Target
Cannabinoid receptor 1
Ligand
BDBM50516787
Substrate
Meas. Tech.
ChEMBL_1866903 (CHEMBL4367878)
Ki
82±n/a nM
Citation
 Ghonim, AELigresti, ARabbito, AMahmoud, AMDi Marzo, VOsman, NAAbadi, AH Structure-activity relationships of thiazole and benzothiazole derivatives as selective cannabinoid CB2 agonists with in vivo anti-inflammatory properties. Eur J Med Chem 180:154-170 (2019)  
Target
Name:
Cannabinoid receptor 1
Synonyms:
CANN6 CB-R CNR CNR1_HUMAN Cannabinoid receptor Cannabinoid receptor 1 (brain)
Type:
G Protein-Coupled Receptor (GPCR)
Mol. Mass.:
52868.96
Organism:
Homo sapiens (Human)
Description:
P21554
Residue:
472
  
Inhibitor
Name:
BDBM50516787
Synonyms:
CHEMBL4556046
Type:
Small organic molecule
Emp. Form.:
C18H20N2OS
Mol. Mass.:
312.429
SMILES:
O=C(NC12CC3CC(CC(C3)C1)C2)c1nc2ccccc2s1
: