Target
Cannabinoid receptor 2
Ligand
BDBM50516776
Substrate
Meas. Tech.
ChEMBL_1866904 (CHEMBL4367879)
Ki
12±n/a nM
Citation
 Ghonim, AELigresti, ARabbito, AMahmoud, AMDi Marzo, VOsman, NAAbadi, AH Structure-activity relationships of thiazole and benzothiazole derivatives as selective cannabinoid CB2 agonists with in vivo anti-inflammatory properties. Eur J Med Chem 180:154-170 (2019)  
Target
Name:
Cannabinoid receptor 2
Synonyms:
CANNABINOID CB2 CB2 CB2B CNR2_HUMAN Cannabinoid CB2 receptor Cannabinoid receptor 2 (CB2R) | hCB2
Type:
G Protein-Coupled Receptor (GPCR)
Mol. Mass.:
39690.94
Organism:
Homo sapiens (Human)
Description:
P34972
Residue:
360
  
Inhibitor
Name:
BDBM50516776
Synonyms:
CHEMBL4437741
Type:
Small organic molecule
Emp. Form.:
C23H30N2OS
Mol. Mass.:
382.562
SMILES:
CCCCCn1c2ccccc2s\c1=N\C(=O)C12CC3CC(CC(C3)C1)C2
: