Target
Amine oxidase [flavin-containing] B
Ligand
BDBM50516838
Substrate
Meas. Tech.
ChEMBL_1867006 (CHEMBL4367981)
IC50
15±n/a nM
Citation
 Zhang, CYang, KYu, SSu, JYuan, SHan, JChen, YGu, JZhou, TBai, RXie, Y Design, synthesis and biological evaluation of hydroxypyridinone-coumarin hybrids as multimodal monoamine oxidase B inhibitors and iron chelates against Alzheimer's disease. Eur J Med Chem 180:367-382 (2019)  
Target
Name:
Amine oxidase [flavin-containing] B
Synonyms:
AOFB_HUMAN MAOB Monoamine oxidase type B (MAO B) Monoamine oxidase type B (MAOB)
Type:
Protein
Mol. Mass.:
58768.76
Organism:
Homo sapiens (Human)
Description:
P27338
Residue:
520
  
Inhibitor
Name:
BDBM50516838
Synonyms:
CHEMBL4561787
Type:
Small organic molecule
Emp. Form.:
C23H18FNO5
Mol. Mass.:
407.3911
SMILES:
Cc1c(O)c(=O)ccn1Cc1cc2ccc(OCc3cccc(F)c3)cc2oc1=O
: