Target
Alpha-1D adrenergic receptor
Ligand
BDBM50071650
Substrate
Meas. Tech.
ChEBML_33019
Ki
644±n/a nM
Citation
 Nerenberg, JBErb, JMThompson, WJLee, HYGuare, JPMunson, PMBergman, JMHuff, JRBroten, TPChang, RSChen, TBO'Malley, SSchorn, TWScott, AL Design and synthesis of N-alkylated saccharins as selective alpha-1a adrenergic receptor antagonists. Bioorg Med Chem Lett 8:2467-72 (1999)  
Target
Name:
Alpha-1D adrenergic receptor
Synonyms:
ADA1D_HUMAN ADRA1D Adrenergic receptor alpha Alpha 1D-adrenoreceptor Alpha-1D adrenoceptor adrenergic Alpha1D
Type:
Enzyme Catalytic Domain
Mol. Mass.:
60485.82
Organism:
Homo sapiens (Human)
Description:
adrenergic Alpha1D ADRA1D HUMAN::P25100
Residue:
572
  
Inhibitor
Name:
BDBM50071650
Synonyms:
6-Methyl-3-{1-[4-(1,1,3-trioxo-1,3-dihydro-1lambda*6*-benzo[d]isothiazol-2-yl)-butyl]-piperidin-4-yl}-3H-benzooxazol-2-one | CHEMBL83041
Type:
Small organic molecule
Emp. Form.:
C24H27N3O5S
Mol. Mass.:
469.553
SMILES:
Cc1ccc2n(C3CCN(CCCCN4C(=O)c5ccccc5S4(=O)=O)CC3)c(=O)oc2c1
: