Target
Cannabinoid receptor 1
Ligand
BDBM50517076
Substrate
Meas. Tech.
ChEMBL_1867313 (CHEMBL4368288)
EC50
>10000±n/a nM
Citation
 Hurst, DPGarai, SKulkarni, PMSchaffer, PCReggio, PHThakur, GA Identification of CB1 Receptor Allosteric Sites Using Force-Biased MMC Simulated Annealing and Validation by Structure-Activity Relationship Studies. ACS Med Chem Lett 10:1216-1221 (2019)  
Target
Name:
Cannabinoid receptor 1
Synonyms:
Brain-type cannabinoid receptor CB-R CNR1_MOUSE Cannabinoid receptor | Cnr1
Type:
Enzyme
Mol. Mass.:
52842.52
Organism:
Mus musculus (Mouse)
Description:
P47746
Residue:
473
  
Inhibitor
Name:
BDBM50517076
Synonyms:
CHEMBL4593957
Type:
Small organic molecule
Emp. Form.:
C18H16N2O2
Mol. Mass.:
292.3318
SMILES:
[O-][N+](=O)CC(c1cc[nH]c1-c1ccccc1)c1ccccc1
: