Target
Carbonic anhydrase 2
Ligand
BDBM50517088
Substrate
Meas. Tech.
ChEMBL_1867316 (CHEMBL4368291)
Ki
4.0±n/a nM
Citation
 Bozdag, MFerraroni, MWard, CCarta, FBua, SAngeli, ALangdon, SPKunkler, IHAl-Tamimi, ASSupuran, CT Carbonic anhydrase inhibitors based on sorafenib scaffold: Design, synthesis, crystallographic investigation and effects on primary breast cancer cells. Eur J Med Chem 182:0 (2019)  
Target
Name:
Carbonic anhydrase 2
Synonyms:
CA-II CAC Carbonate dehydratase II Carbonic anhydrase 2 (CA-II) Carbonic anhydrase C Carbonic anhydrase II (CA-II) Carbonic anhydrase II (hCA II) | Carbonic anhydrase isoenzyme II (hCA II)
Type:
Enzyme
Mol. Mass.:
29250.71
Organism:
Homo sapiens (Human)
Description:
P00918
Residue:
260
  
Inhibitor
Name:
BDBM50517088
Synonyms:
CHEMBL4543156
Type:
Small organic molecule
Emp. Form.:
C14H11ClF3N3O4S
Mol. Mass.:
409.768
SMILES:
NS(=O)(=O)Oc1cccc(NC(=O)Nc2ccc(Cl)c(c2)C(F)(F)F)c1
: