Target
Carbonic anhydrase 9
Ligand
BDBM50517088
Substrate
Meas. Tech.
ChEMBL_1867318 (CHEMBL4368293)
Ki
0.800000±n/a nM
Citation
 Bozdag, MFerraroni, MWard, CCarta, FBua, SAngeli, ALangdon, SPKunkler, IHAl-Tamimi, ASSupuran, CT Carbonic anhydrase inhibitors based on sorafenib scaffold: Design, synthesis, crystallographic investigation and effects on primary breast cancer cells. Eur J Med Chem 182:0 (2019)  
Target
Name:
Carbonic anhydrase 9
Synonyms:
CA-IX CAH9_HUMAN Carbonic anhydrase 9 (CA IX) Carbonic anhydrase 9 precursor Carbonic anhydrase IX (CAIX) Carbonic anhydrases; II & IX MN RCC-associated antigen G250
Type:
Enzyme
Mol. Mass.:
49669.03
Organism:
Homo sapiens (Human)
Description:
Catalytic domain of human cloned isozyme was used in the assay
Residue:
459
  
Inhibitor
Name:
BDBM50517088
Synonyms:
CHEMBL4543156
Type:
Small organic molecule
Emp. Form.:
C14H11ClF3N3O4S
Mol. Mass.:
409.768
SMILES:
NS(=O)(=O)Oc1cccc(NC(=O)Nc2ccc(Cl)c(c2)C(F)(F)F)c1
: