Target
Carbonic anhydrase 7
Ligand
BDBM50517088
Substrate
Meas. Tech.
ChEMBL_1867317 (CHEMBL4368292)
Ki
3.5±n/a nM
Citation
 Bozdag, MFerraroni, MWard, CCarta, FBua, SAngeli, ALangdon, SPKunkler, IHAl-Tamimi, ASSupuran, CT Carbonic anhydrase inhibitors based on sorafenib scaffold: Design, synthesis, crystallographic investigation and effects on primary breast cancer cells. Eur J Med Chem 182:0 (2019)  
Target
Name:
Carbonic anhydrase 7
Synonyms:
CA-VII CAH7_HUMAN Carbonic anhydrase Carbonic anhydrase VII (CA VII)
Type:
Enzyme
Mol. Mass.:
29664.11
Organism:
Homo sapiens (Human)
Description:
Human cloned isozyme.
Residue:
264
  
Inhibitor
Name:
BDBM50517088
Synonyms:
CHEMBL4543156
Type:
Small organic molecule
Emp. Form.:
C14H11ClF3N3O4S
Mol. Mass.:
409.768
SMILES:
NS(=O)(=O)Oc1cccc(NC(=O)Nc2ccc(Cl)c(c2)C(F)(F)F)c1
: