Target
D(2) dopamine receptor
Ligand
BDBM50071854
Substrate
Meas. Tech.
ChEMBL_62084 (CHEMBL672456)
Ki
45.8±n/a nM
Citation
 Mewshaw, REVerwijs, AShi, XMcGaughey, GBNelson, JAMazandarani, HBrennan, JAMarquis, KLCoupet, JAndree, TH New generation dopaminergic agents. 5. Heterocyclic bioisosteres that exploit the 3-OH-N1-phenylpiperazine dopaminergic template. Bioorg Med Chem Lett 8:2675-80 (1999)  
Target
Name:
D(2) dopamine receptor
Synonyms:
DOPAMINE D2 DOPAMINE D2 Short Dopamine D2 receptor Drd2
Type:
G Protein-Coupled Receptor (GPCR)
Mol. Mass.:
50931.60
Organism:
Rattus norvegicus (rat)
Description:
P61169
Residue:
444
  
Inhibitor
Name:
BDBM50071854
Synonyms:
4-(4-Benzyl-piperazin-1-yl)-1,3-dihydro-benzoimidazol-2-one | CHEMBL315864
Type:
Small organic molecule
Emp. Form.:
C18H20N4O
Mol. Mass.:
308.3776
SMILES:
O=c1[nH]c2cccc(N3CCN(Cc4ccccc4)CC3)c2[nH]1
: