Target
D(2) dopamine receptor
Ligand
BDBM50071857
Substrate
Meas. Tech.
ChEBML_62083
Ki
3.2±n/a nM
Citation
 Mewshaw, REVerwijs, AShi, XMcGaughey, GBNelson, JAMazandarani, HBrennan, JAMarquis, KLCoupet, JAndree, TH New generation dopaminergic agents. 5. Heterocyclic bioisosteres that exploit the 3-OH-N1-phenylpiperazine dopaminergic template. Bioorg Med Chem Lett 8:2675-80 (1999)  
Target
Name:
D(2) dopamine receptor
Synonyms:
DOPAMINE D2 DOPAMINE D2 Short Dopamine D2 receptor Drd2
Type:
G Protein-Coupled Receptor (GPCR)
Mol. Mass.:
50931.60
Organism:
Rattus norvegicus (rat)
Description:
P61169
Residue:
444
  
Inhibitor
Name:
BDBM50071857
Synonyms:
4-(4-Benzyl-piperazin-1-yl)-1H-indole | CHEMBL328051
Type:
Small organic molecule
Emp. Form.:
C19H21N3
Mol. Mass.:
291.3901
SMILES:
C(N1CCN(CC1)c1cccc2[nH]ccc12)c1ccccc1
: