Target
D(3) dopamine receptor
Ligand
BDBM50069907
Substrate
Meas. Tech.
ChEBML_62277
Ki
29±n/a nM
Citation
 Mewshaw, REVerwijs, AShi, XMcGaughey, GBNelson, JAMazandarani, HBrennan, JAMarquis, KLCoupet, JAndree, TH New generation dopaminergic agents. 5. Heterocyclic bioisosteres that exploit the 3-OH-N1-phenylpiperazine dopaminergic template. Bioorg Med Chem Lett 8:2675-80 (1999)  
Target
Name:
D(3) dopamine receptor
Synonyms:
DOPAMINE D3 DRD3_HUMAN Dopamine D3 receptor (D3) Dopamine receptor Dopamine receptor D3
Type:
Mol. Mass.:
44243.43
Organism:
Homo sapiens (Human)
Description:
Residue:
400
  
Inhibitor
Name:
BDBM50069907
Synonyms:
1-benzyl-4-(3-hydroxyphenyl)piperazine CHEMBL88365
Type:
Small organic molecule
Emp. Form.:
C17H20N2O
Mol. Mass.:
268.3535
SMILES:
Oc1cccc(c1)N1CCN(Cc2ccccc2)CC1
: