Target
D(2) dopamine receptor
Ligand
BDBM50071855
Substrate
Meas. Tech.
ChEBML_60225
Ki
4.1±n/a nM
Citation
 Mewshaw, REVerwijs, AShi, XMcGaughey, GBNelson, JAMazandarani, HBrennan, JAMarquis, KLCoupet, JAndree, TH New generation dopaminergic agents. 5. Heterocyclic bioisosteres that exploit the 3-OH-N1-phenylpiperazine dopaminergic template. Bioorg Med Chem Lett 8:2675-80 (1999)  
Target
Name:
D(2) dopamine receptor
Synonyms:
D(2) dopamine receptor DOPAMINE D2 Long DRD2 Dopamine D2 receptor Dopamine D2 receptor (D2R) Dopamine2-like | d2
Type:
Cell-surface receptors
Mol. Mass.:
50647.10
Organism:
Homo sapiens (Human)
Description:
P14416
Residue:
443
  
Inhibitor
Name:
BDBM50071855
Synonyms:
4-(4-Benzyl-piperazin-1-yl)-2-trifluoromethyl-1H-benzoimidazole | CHEMBL88289
Type:
Small organic molecule
Emp. Form.:
C19H19F3N4
Mol. Mass.:
360.3762
SMILES:
FC(F)(F)c1nc2c(cccc2[nH]1)N1CCN(Cc2ccccc2)CC1
: