Target
D(4) dopamine receptor
Ligand
BDBM50071858
Substrate
Meas. Tech.
ChEBML_61186
Ki
1.7±n/a nM
Citation
 Mewshaw, REVerwijs, AShi, XMcGaughey, GBNelson, JAMazandarani, HBrennan, JAMarquis, KLCoupet, JAndree, TH New generation dopaminergic agents. 5. Heterocyclic bioisosteres that exploit the 3-OH-N1-phenylpiperazine dopaminergic template. Bioorg Med Chem Lett 8:2675-80 (1999)  
Target
Name:
D(4) dopamine receptor
Synonyms:
D(2C) dopamine receptor DOPAMINE D4.2 DRD4 Dopamine D4 receptor
Type:
Enzyme
Mol. Mass.:
48373.19
Organism:
Homo sapiens (Human)
Description:
P21917
Residue:
419
  
Inhibitor
Name:
BDBM50071858
Synonyms:
4-(4-Benzyl-piperazin-1-yl)-5-chloro-1H-indole | CHEMBL311539
Type:
Small organic molecule
Emp. Form.:
C19H20ClN3
Mol. Mass.:
325.835
SMILES:
Clc1ccc2[nH]ccc2c1N1CCN(Cc2ccccc2)CC1
: