Target
D(4) dopamine receptor
Ligand
BDBM50071857
Substrate
Meas. Tech.
ChEBML_61186
Ki
15±n/a nM
Citation
 Mewshaw, REVerwijs, AShi, XMcGaughey, GBNelson, JAMazandarani, HBrennan, JAMarquis, KLCoupet, JAndree, TH New generation dopaminergic agents. 5. Heterocyclic bioisosteres that exploit the 3-OH-N1-phenylpiperazine dopaminergic template. Bioorg Med Chem Lett 8:2675-80 (1999)  
Target
Name:
D(4) dopamine receptor
Synonyms:
D(2C) dopamine receptor DOPAMINE D4.2 DRD4 Dopamine D4 receptor
Type:
Enzyme
Mol. Mass.:
48373.19
Organism:
Homo sapiens (Human)
Description:
P21917
Residue:
419
  
Inhibitor
Name:
BDBM50071857
Synonyms:
4-(4-Benzyl-piperazin-1-yl)-1H-indole | CHEMBL328051
Type:
Small organic molecule
Emp. Form.:
C19H21N3
Mol. Mass.:
291.3901
SMILES:
C(N1CCN(CC1)c1cccc2[nH]ccc12)c1ccccc1
: