Target
D(3) dopamine receptor
Ligand
BDBM50071852
Substrate
Meas. Tech.
ChEBML_62277
Ki
871±n/a nM
Citation
 Mewshaw, REVerwijs, AShi, XMcGaughey, GBNelson, JAMazandarani, HBrennan, JAMarquis, KLCoupet, JAndree, TH New generation dopaminergic agents. 5. Heterocyclic bioisosteres that exploit the 3-OH-N1-phenylpiperazine dopaminergic template. Bioorg Med Chem Lett 8:2675-80 (1999)  
Target
Name:
D(3) dopamine receptor
Synonyms:
DOPAMINE D3 DRD3_HUMAN Dopamine D3 receptor (D3) Dopamine receptor Dopamine receptor D3
Type:
Mol. Mass.:
44243.43
Organism:
Homo sapiens (Human)
Description:
Residue:
400
  
Inhibitor
Name:
BDBM50071852
Synonyms:
4-(4-Benzyl-piperazin-1-yl)-1H-benzoimidazole | CHEMBL88837
Type:
Small organic molecule
Emp. Form.:
C18H20N4
Mol. Mass.:
292.3782
SMILES:
C(N1CCN(CC1)c1cccc2[nH]cnc12)c1ccccc1
: