Target
Hepatocyte growth factor receptor
Ligand
BDBM28031
Substrate
Meas. Tech.
ChEMBL_1867526 (CHEMBL4368501)
IC50
214±n/a nM
Citation
 Collie, GWKoh, CMO'Neill, DJStubbs, CJKhurana, PEddershaw, ASnijder, AMauritzson, FBarlind, LDale, ILShaw, JPhillips, CHennessy, EJCheung, TNarvaez, AJ Structural and Molecular Insight into Resistance Mechanisms of First Generation cMET Inhibitors. ACS Med Chem Lett 10:1322-1327 (2019)  
Target
Name:
Hepatocyte growth factor receptor
Synonyms:
Hepatocyte growth factor receptor Hepatocyte growth factor receptor (c-MET) MET Met proto-oncogene (hepatocyte growth factor receptor) Tyrosine-protein kinase Met (c-Met) c-Met kinase
Type:
Protein
Mol. Mass.:
155559.73
Organism:
Homo sapiens (Human)
Description:
P08581
Residue:
1390
  
Inhibitor
Name:
BDBM28031
Synonyms:
BMS-777607 | N-{4-[(2-amino-3-chloropyridin-4-yl)oxy]-3-fluorophenyl}-4-ethoxy-1-(4-fluorophenyl)-2-oxo-1,2-dihydropyridine-3-carboxamide
Type:
Small organic molecule
Emp. Form.:
C25H19ClF2N4O4
Mol. Mass.:
512.893
SMILES:
CCOc1ccn(-c2ccc(F)cc2)c(=O)c1C(=O)Nc1ccc(Oc2ccnc(N)c2Cl)c(F)c1
: