Target
5-hydroxytryptamine receptor 2A
Ligand
BDBM50115644
Substrate
Meas. Tech.
ChEMBL_1867546 (CHEMBL4368521)
Ki
8.2±n/a nM
Citation
 ?elaszczyk, DJakubczyk, MPytka, KRapacz, AWalczak, MJaniszewska, PPa?czyk, K?mudzki, PS?oczy?ska, KMarona, HWaszkielewicz, AM Design, synthesis and evaluation of activity and pharmacokinetic profile of new derivatives of xanthone and piperazine in the central nervous system. Bioorg Med Chem Lett 29:0 (2019)  
Target
Name:
5-hydroxytryptamine receptor 2A
Synonyms:
5-HT-2 5-HT2A 5-hydroxytryptamine receptor 2A (5HT-2A) 5HT2A_HUMAN HTR2A | Serotonin receptor 2A
Type:
undefined
Mol. Mass.:
52607.65
Organism:
Homo sapiens (Human)
Description:
P28223
Residue:
471
  
Inhibitor
Name:
BDBM50115644
Synonyms:
(+/-)-12-Methyl-1,2,3,4,9,13b-hexahydro-2,4a,5-triaza-tribenzo[a,c,e]cycloheptene CHEMBL654 ORG 3770 | REMERON
Type:
Small organic molecule
Emp. Form.:
C17H19N3
Mol. Mass.:
265.3529
SMILES:
CN1CCN2C(C1)c1ccccc1Cc1cccnc21
: