Target
Gastrin/cholecystokinin type B receptor
Ligand
BDBM50517381
Substrate
Meas. Tech.
ChEMBL_1868967 (CHEMBL4370033)
EC50
0.436516±n/a nM
Citation
 Sensfuss, UKruse, TSkyggebjerg, RBUldam, HKVestergaard, BHuus, KVinther, TNReinau, MESchéele, SClausen, TR Structure-Activity Relationships and Characterization of Highly Selective, Long-Acting, Peptide-Based Cholecystokinin 1 Receptor Agonists. J Med Chem 62:1407-1419 (2019)  
Target
Name:
Gastrin/cholecystokinin type B receptor
Synonyms:
CCK-2 receptor CCK-BR CCKRB Cholecystokinin receptor GASR_HUMAN | Gastrin/cholecystokinin type B receptor
Type:
G Protein-Coupled Receptor (GPCR)
Mol. Mass.:
48445.79
Organism:
Homo sapiens (Human)
Description:
Stable expression of human CCK-2 receptors in HEK 293 cells.
Residue:
447
  
Inhibitor
Name:
BDBM50517381
Synonyms:
CHEMBL4561184
Type:
Small organic molecule
Emp. Form.:
C89H131N13O30S
Mol. Mass.:
1895.127
SMILES:
CCCC[C@H](NC(=O)[C@H](Cc1ccc(OS(O)(=O)=O)cc1)NC(=O)[C@H](CC(O)=O)NC(=O)COCCOCCNC(=O)COCCOCCNC(=O)CC[C@H](NC(=O)CCCCCCCCCCCCCCCCC(O)=O)C(O)=O)C(=O)N[C@@H](CCC(O)=O)C(=O)N[C@@H](Cc1c[nH]c2ccccc12)C(=O)N[C@@H](CCCC)C(=O)N[C@@H](CC(O)=O)C(=O)N[C@@H](Cc1ccccc1)C(N)=O
: