Target
Metabotropic glutamate receptor 4
Ligand
BDBM50072170
Substrate
Meas. Tech.
ChEBML_104633
IC50
8680±n/a nM
Citation
 Collado, IEzquerra, JMazón, APedregal, CYruretagoyena, BKingston, AETomlinson, RWright, RAJohnson, BGSchoepp, DD 2,3'-disubstituted-2-(2'-carboxycyclopropyl)glycines as potent and selective antagonists of metabotropic glutamate receptors. Bioorg Med Chem Lett 8:2849-54 (1999)  
Target
Name:
Metabotropic glutamate receptor 4
Synonyms:
GPRC1D GRM4_HUMAN MGLUR4 Metabotropic glutamate receptor 4 (mGlu4) metabotropic glutamate 4
Type:
Protein
Mol. Mass.:
101899.95
Organism:
Homo sapiens (Human)
Description:
Q14833
Residue:
912
  
Inhibitor
Name:
BDBM50072170
Synonyms:
(1S,2S,3S)-2-[1-Amino-1-carboxy-2-(9H-xanthen-9-yl)-ethyl]-3-isobutyl-cyclopropanecarboxylic acid | CHEMBL97200
Type:
Small organic molecule
Emp. Form.:
C24H27NO5
Mol. Mass.:
409.4749
SMILES:
CC(C)C[C@@H]1[C@@H]([C@H]1C(N)(CC1c2ccccc2Oc2ccccc12)C(O)=O)C(O)=O
: