Target
Sodium-dependent serotonin transporter
Ligand
BDBM50151988
Substrate
Meas. Tech.
ChEMBL_1869995 (CHEMBL4371162)
IC50
0.400000±n/a nM
Citation
 Meanwell, NA Fluorine and Fluorinated Motifs in the Design and Application of Bioisosteres for Drug Design. J Med Chem 61:5822-5880 (2018)  
Target
Name:
Sodium-dependent serotonin transporter
Synonyms:
5-HT Transporter 5HT transporter Anandamid membrane transporter, AMT Monoamine transporters; Norepinephrine & serotonin Slc6a4 Sodium-dependent serotonin transporter (SERT) | imipramine receptor
Type:
Multi-pass membrane protein
Mol. Mass.:
70168.43
Organism:
Rattus norvegicus (rat)
Description:
P31652
Residue:
630
  
Inhibitor
Name:
BDBM50151988
Synonyms:
3-{4-[4-(2,3-Dihydro-benzo[1,4]dioxin-6-yl)-piperazin-1-yl]-butyl}-1H-indole-5-carbonitrile | CHEMBL189709
Type:
Small organic molecule
Emp. Form.:
C25H28N4O2
Mol. Mass.:
416.5154
SMILES:
N#Cc1ccc2[nH]cc(CCCCN3CCN(CC3)c3ccc4OCCOc4c3)c2c1
: