Target
Sodium-dependent serotonin transporter
Ligand
BDBM50152012
Substrate
Meas. Tech.
ChEMBL_1869995 (CHEMBL4371162)
IC50
0.300000±n/a nM
Citation
 Meanwell, NA Fluorine and Fluorinated Motifs in the Design and Application of Bioisosteres for Drug Design. J Med Chem 61:5822-5880 (2018)  
Target
Name:
Sodium-dependent serotonin transporter
Synonyms:
5-HT Transporter 5HT transporter Anandamid membrane transporter, AMT Monoamine transporters; Norepinephrine & serotonin Slc6a4 Sodium-dependent serotonin transporter (SERT) | imipramine receptor
Type:
Multi-pass membrane protein
Mol. Mass.:
70168.43
Organism:
Rattus norvegicus (rat)
Description:
P31652
Residue:
630
  
Inhibitor
Name:
BDBM50152012
Synonyms:
5-{4-[4-(5-Fluoro-1H-indol-3-yl)-butyl]-piperazin-1-yl}-benzofuran-2-carboxylic acid amide | CHEMBL360390
Type:
Small organic molecule
Emp. Form.:
C25H27FN4O2
Mol. Mass.:
434.5059
SMILES:
NC(=O)c1cc2cc(ccc2o1)N1CCN(CCCCc2c[nH]c3ccc(F)cc23)CC1
: