Target
Oxytocin receptor
Ligand
BDBM50072372
Substrate
Meas. Tech.
ChEBML_149050
Ki
17±n/a nM
Citation
 Kuo, MSBock, MGFreidinger, RMGuidotti, MTLis, EVPawluczyk, JMPerlow, DSPettibone, DJQuigley, AGReiss, DRWilliams, PDWoyden, CJ Nonpeptide oxytocin antagonists: potent, orally bioavailable analogs of L-371,257 containing a 1-R-(pyridyl)ethyl ether terminus. Bioorg Med Chem Lett 8:3081-6 (1999)  
Target
Name:
Oxytocin receptor
Synonyms:
OT-R OXYR_HUMAN | Oxytocin
Type:
Enzyme Catalytic Domain
Mol. Mass.:
42793.26
Organism:
Homo sapiens (Human)
Description:
Oxytocin OXTR HEK293::B2R9L7
Residue:
389
  
Inhibitor
Name:
BDBM50072372
Synonyms:
1-[1-(4-Isopropoxy-2-methoxy-benzoyl)-piperidin-4-yl]-1,4-dihydro-benzo[d][1,3]oxazin-2-one | CHEMBL105039
Type:
Small organic molecule
Emp. Form.:
C24H28N2O5
Mol. Mass.:
424.4895
SMILES:
COc1cc(OC(C)C)ccc1C(=O)N1CCC(CC1)N1C(=O)OCc2ccccc12
: