Target
Beta-1 adrenergic receptor
Ligand
BDBM50002133
Substrate
Meas. Tech.
ChEBML_37376
IC50
5000±n/a nM
Citation
 Naylor, EMColandrea, VJCandelore, MRCascieri, MAColwell, LFDeng, LFeeney, WPForrest, MJHom, GJMacIntyre, DEStrader, CDTota, LWang, PRWyvratt, MJFisher, MHWeber, AE 3-Pyridylethanolamines: potent and selective human beta 3 adrenergic receptor agonists. Bioorg Med Chem Lett 8:3087-92 (1999)  
Target
Name:
Beta-1 adrenergic receptor
Synonyms:
ADRB1 ADRB1_HUMAN Beta-1 adrenoceptor | adrenergic Beta1
Type:
G Protein-Coupled Receptor (GPCR)
Mol. Mass.:
51338.40
Organism:
Homo sapiens (Human)
Description:
P08588
Residue:
477
  
Inhibitor
Name:
BDBM50002133
Synonyms:
(+/-)-2-(4-((R)-2-((R)-2-(3-chlorophenyl)-2-hydroxyethylamino)propyl)phenoxy)acetic acid (4-{2-[(R)-2-((R)-3-Chloro-phenyl)-2-hydroxy-ethylamino]-propyl}-phenoxy)-acetic acid (BRL 37,344)(4-{2-[2-(3-Chloro-phenyl)-2-hydroxy-ethylamino]-propyl}-phenoxy)-acetic acid 2-(4-((R)-2-((R)-2-(3-chlorophenyl)-2-hydroxyethylamino)propyl)phenoxy)acetic acid CHEMBL284782
Type:
Small organic molecule
Emp. Form.:
C19H22ClNO4
Mol. Mass.:
363.835
SMILES:
C[C@H](Cc1ccc(OCC(O)=O)cc1)NC[C@H](O)c1cccc(Cl)c1
: