Target
Muscarinic acetylcholine receptor M4
Ligand
BDBM50518722
Substrate
Meas. Tech.
ChEMBL_1872177 (CHEMBL4373344)
EC50
2200±n/a nM
Citation
 Poslusney, MSSalovich, JMWood, MRMelancon, BJBollinger, KALuscombe, VBRodriguez, ALEngers, DWBridges, TMNiswender, CMConn, PJLindsley, CW Novel M Bioorg Med Chem Lett 29:362-366 (2019)  
Target
Name:
Muscarinic acetylcholine receptor M4
Synonyms:
ACM4_HUMAN Cholinergic, muscarinic M4 Muscarinic acetylcholine receptor M2 and M4
Type:
Enzyme Catalytic Domain
Mol. Mass.:
53079.31
Organism:
Homo sapiens (Human)
Description:
Cholinergic, muscarinic M4 CHRM4 HUMAN M3::P08173
Residue:
479
  
Inhibitor
Name:
BDBM50518722
Synonyms:
CHEMBL4517529
Type:
Small organic molecule
Emp. Form.:
C19H20FN3O2S
Mol. Mass.:
373.444
SMILES:
CCc1c(sc2nnc(C)c(C)c12)C(=O)NCc1ccc(OC)c(F)c1
: