Target
Diacylglycerol lipase-alpha
Ligand
BDBM50519341
Substrate
Meas. Tech.
ChEMBL_1874961 (CHEMBL4376250)
IC50
3.8±n/a nM
Citation
 Janssen, APAvan Hengst, JMABéquignon, OJMDeng, Hvan Westen, GJPvan der Stelt, M Structure Kinetics Relationships and Molecular Dynamics Show Crucial Role for Heterocycle Leaving Group in Irreversible Diacylglycerol Lipase Inhibitors. J Med Chem 62:7910-7922 (2019)  
Target
Name:
Diacylglycerol lipase-alpha
Synonyms:
DGL-alpha Dagla Neural stem cell-derived dendrite regulator Sn1-specific diacylglycerol lipase alpha
Type:
PROTEIN
Mol. Mass.:
115371.22
Organism:
Mus musculus
Description:
ChEMBL_101098
Residue:
1044
  
Inhibitor
Name:
BDBM50519341
Synonyms:
CHEMBL4437021
Type:
Small organic molecule
Emp. Form.:
C28H26F2N4O2
Mol. Mass.:
488.5284
SMILES:
OC(c1cn(nn1)C(=O)N1CCCC[C@@H]1Cc1ccccc1)(c1ccc(F)cc1)c1ccc(F)cc1
: