Target
Tyrosine-protein kinase receptor UFO
Ligand
BDBM50519419
Substrate
Meas. Tech.
ChEMBL_1875226 (CHEMBL4376515)
IC50
8.2±n/a nM
Citation
 Wang, MSZhuo, LSYang, FPWang, WJHuang, WYang, GF Synthesis and biological evaluation of new MET inhibitors with 1,6-naphthyridinone scaffold. Eur J Med Chem 185:0 (2020)  
Target
Name:
Tyrosine-protein kinase receptor UFO
Synonyms:
AXL TEL/AXL UFO | UFO_HUMAN
Type:
Enzyme
Mol. Mass.:
98316.97
Organism:
Homo sapiens (Human)
Description:
P30530
Residue:
894
  
Inhibitor
Name:
BDBM50519419
Synonyms:
CHEMBL4584949
Type:
Small organic molecule
Emp. Form.:
C30H23F2N5O3
Mol. Mass.:
539.5321
SMILES:
Cn1cc(-c2ccc(F)cc2)c(=O)c2c(Nc3ccc(Oc4ccnc(NC(=O)C5CC5)c4)c(F)c3)nccc12
: