Target
Macrophage-stimulating protein receptor
Ligand
BDBM50519419
Substrate
Meas. Tech.
ChEMBL_1875229 (CHEMBL4376518)
IC50
346±n/a nM
Citation
 Wang, MSZhuo, LSYang, FPWang, WJHuang, WYang, GF Synthesis and biological evaluation of new MET inhibitors with 1,6-naphthyridinone scaffold. Eur J Med Chem 185:0 (2020)  
Target
Name:
Macrophage-stimulating protein receptor
Synonyms:
2.7.10.1 CDw136 MST1R Macrophage-stimulating protein receptor alpha chain PTK8 RON Tyrosine kinase receptor ron | p185-Ron
Type:
Protein
Mol. Mass.:
152270.76
Organism:
Homo sapiens (Human)
Description:
Q04912
Residue:
1400
  
Inhibitor
Name:
BDBM50519419
Synonyms:
CHEMBL4584949
Type:
Small organic molecule
Emp. Form.:
C30H23F2N5O3
Mol. Mass.:
539.5321
SMILES:
Cn1cc(-c2ccc(F)cc2)c(=O)c2c(Nc3ccc(Oc4ccnc(NC(=O)C5CC5)c4)c(F)c3)nccc12
: