Target
High affinity nerve growth factor receptor
Ligand
BDBM50519419
Substrate
Meas. Tech.
ChEMBL_1875230 (CHEMBL4376519)
IC50
33±n/a nM
Citation
 Wang, MSZhuo, LSYang, FPWang, WJHuang, WYang, GF Synthesis and biological evaluation of new MET inhibitors with 1,6-naphthyridinone scaffold. Eur J Med Chem 185:0 (2020)  
Target
Name:
High affinity nerve growth factor receptor
Synonyms:
2.7.10.1 NTRK1 NTRK1_HUMAN Neurotrophic tyrosine kinase receptor type 1 Synonyms=MTC TRK1-transforming tyrosine kinase protein TRKA GN Trk-A Tropomyosin-related kinase A Tyrosine kinase receptor Tyrosine kinase receptor A Tyrosine kinase receptor A (Trk-A) gp140trk | p140-TrkA
Type:
Mol. Mass.:
87498.18
Organism:
Homo sapiens (Human)
Description:
P04629
Residue:
796
  
Inhibitor
Name:
BDBM50519419
Synonyms:
CHEMBL4584949
Type:
Small organic molecule
Emp. Form.:
C30H23F2N5O3
Mol. Mass.:
539.5321
SMILES:
Cn1cc(-c2ccc(F)cc2)c(=O)c2c(Nc3ccc(Oc4ccnc(NC(=O)C5CC5)c4)c(F)c3)nccc12
: