Target
Vascular endothelial growth factor receptor 2
Ligand
BDBM50519417
Substrate
Meas. Tech.
ChEMBL_1875223 (CHEMBL4376512)
IC50
61±n/a nM
Citation
 Wang, MSZhuo, LSYang, FPWang, WJHuang, WYang, GF Synthesis and biological evaluation of new MET inhibitors with 1,6-naphthyridinone scaffold. Eur J Med Chem 185:0 (2020)  
Target
Name:
Vascular endothelial growth factor receptor 2
Synonyms:
CD_antigen=CD309 Fetal liver kinase 1 (FLK-1) KDR Protein-tyrosine kinase receptor Flk-1 VEGFR-2 VEGFR2 Vascular Endothelial Growth Factor Receptor Kinase 2 Vascular endothelial growth factor receptor 2 (KDR) Vascular endothelial growth factor receptor 2 (VEGFR2) Vascular endothelial growth factor receptor-2 (VEGFR-2)
Type:
Receptor Tyrosine Kinase
Mol. Mass.:
151510.97
Organism:
Homo sapiens (Human)
Description:
P35968
Residue:
1356
  
Inhibitor
Name:
BDBM50519417
Synonyms:
CHEMBL4567013
Type:
Small organic molecule
Emp. Form.:
C30H23F2N5O3
Mol. Mass.:
539.5321
SMILES:
Fc1ccc(cc1)-c1c[nH]c2ccnc(Nc3ccc(Oc4ccnc(NC(=O)C5CCC5)c4)c(F)c3)c2c1=O
: