Target
Hepatocyte growth factor receptor
Ligand
BDBM50519420
Substrate
Meas. Tech.
ChEMBL_1875222 (CHEMBL4376511)
IC50
26±n/a nM
Citation
 Wang, MSZhuo, LSYang, FPWang, WJHuang, WYang, GF Synthesis and biological evaluation of new MET inhibitors with 1,6-naphthyridinone scaffold. Eur J Med Chem 185:0 (2020)  
Target
Name:
Hepatocyte growth factor receptor
Synonyms:
Hepatocyte growth factor receptor Hepatocyte growth factor receptor (c-MET) MET Met proto-oncogene (hepatocyte growth factor receptor) Tyrosine-protein kinase Met (c-Met) c-Met kinase
Type:
Protein
Mol. Mass.:
155559.73
Organism:
Homo sapiens (Human)
Description:
P08581
Residue:
1390
  
Inhibitor
Name:
BDBM50519420
Synonyms:
CHEMBL4518360
Type:
Small organic molecule
Emp. Form.:
C33H29F2N5O4
Mol. Mass.:
597.6113
SMILES:
CC(C)(O)Cn1cc(-c2ccc(F)cc2)c(=O)c2c(Nc3ccc(Oc4ccnc(NC(=O)C5CC5)c4)c(F)c3)nccc12
: