Target
Short transient receptor potential channel 5
Ligand
BDBM50049391
Substrate
Meas. Tech.
ChEMBL_1875698 (CHEMBL4377092)
IC50
450±n/a nM
Citation
 Sharma, SHopkins, CR Review of Transient Receptor Potential Canonical (TRPC5) Channel Modulators and Diseases. J Med Chem 62:7589-7602 (2019)  
Target
Name:
Short transient receptor potential channel 5
Synonyms:
TRP5 TRPC5_HUMAN | Transient receptor protein 5 (TRPC5)
Type:
Enzyme
Mol. Mass.:
111421.47
Organism:
Homo sapiens (Human)
Description:
Q9UL62
Residue:
973
  
Inhibitor
Name:
BDBM50049391
Synonyms:
3,5,7-Trihydroxyflavone 3,5,7-trihydroxy-2-phenyl-4H-benzopyran-4-one CHEMBL309490 Galangin (15) cid_5281616 | norizalpinin
Type:
Small organic molecule
Emp. Form.:
C15H10O5
Mol. Mass.:
270.2369
SMILES:
Oc1cc(O)c2c(c1)oc(-c1ccccc1)c(O)c2=O
: