Target
Purine nucleoside phosphorylase
Ligand
BDBM50195587
Substrate
Meas. Tech.
ChEMBL_1875745 (CHEMBL4377139)
Ki
0.600000±n/a nM
Citation
 Cheviet, TLefebvre-Tournier, IWein, SPeyrottes, S Plasmodium Purine Metabolism and Its Inhibition by Nucleoside and Nucleotide Analogues. J Med Chem 62:8365-8391 (2019)  
Target
Name:
Purine nucleoside phosphorylase
Synonyms:
Purine Nucleoside Phosphorylase (PNP) | pfPNP
Type:
Enzyme
Mol. Mass.:
26857.85
Organism:
Plasmodium falciparum
Description:
Residue:
245
  
Inhibitor
Name:
BDBM50195587
Synonyms:
1,4-DIDEOXY-4-AZA-1-(S)-(9-DEAZAHYPOXANTHIN-9-YL)-D-RIBITOL CHEMBL1213652 Immucillin-H
Type:
Small organic molecule
Emp. Form.:
C11H14N4O4
Mol. Mass.:
266.2533
SMILES:
OC[C@H]1N[C@H]([C@H](O)[C@@H]1O)c1c[nH]c2c1nc[nH]c2=O
: