Target
Adenosine deaminase
Ligand
BDBM50367032
Substrate
Meas. Tech.
ChEMBL_1875737 (CHEMBL4377131)
Ki
14±n/a nM
Citation
 Cheviet, TLefebvre-Tournier, IWein, SPeyrottes, S Plasmodium Purine Metabolism and Its Inhibition by Nucleoside and Nucleotide Analogues. J Med Chem 62:8365-8391 (2019)  
Target
Name:
Adenosine deaminase
Synonyms:
ADA ADA_HUMAN | Adenosine aminohydrolase
Type:
Enzyme
Mol. Mass.:
40759.44
Organism:
Homo sapiens (Human)
Description:
Human recombinant ADA was expressed and purified from an ADA-deficient bacterial strain.
Residue:
363
  
Inhibitor
Name:
BDBM50367032
Synonyms:
COFORMYCIN
Type:
Small organic molecule
Emp. Form.:
C11H16N4O5
Mol. Mass.:
284.2685
SMILES:
OC[C@H]1O[C@H]([C@H](O)[C@@H]1O)n1cnc2[C@H](O)CNC=Nc12
: