Target
Lethal(3)malignant brain tumor-like protein 3
Ligand
BDBM50440614
Substrate
Meas. Tech.
ChEMBL_1875890 (CHEMBL4377284)
Kd
120±n/a nM
Citation
 Xiong, YGreschik, HJohansson, CSeifert, LBacher, JPark, KSBabault, NMartini, MFagan, VLi, FChau, IChristott, TDilworth, DBarsyte-Lovejoy, DVedadi, MArrowsmith, CHBrennan, PFedorov, OJung, MFarnie, GLiu, JOppermann, USchüle, RJin, J Discovery of a Potent and Selective Fragment-like Inhibitor of Methyllysine Reader Protein Spindlin 1 (SPIN1). J Med Chem 62:8996-9007 (2019)  
Target
Name:
Lethal(3)malignant brain tumor-like protein 3
Synonyms:
H-l(3)mbt-like protein 3 L(3)mbt-like protein 3 LMBL3_HUMAN Lethal(3)malignant brain tumor-like protein 3 (L3MBTL3) MBT1
Type:
Protein
Mol. Mass.:
88334.17
Organism:
Homo sapiens (Human)
Description:
Residue:
780
  
Inhibitor
Name:
BDBM50440614
Synonyms:
CHEMBL2426364
Type:
Small organic molecule
Emp. Form.:
C32H43N5O2
Mol. Mass.:
529.7161
SMILES:
O=C(N1CCC(CC1)N1CCCC1)c1ccc(C(=O)N2CCC(CC2)N2CCCC2)c(Nc2ccccc2)c1
: