Target
Non-receptor tyrosine-protein kinase TYK2 [5-1181]
Ligand
BDBM50519542
Substrate
Meas. Tech.
ChEMBL_1875988 (CHEMBL4377382)
IC50
310±n/a nM
Citation
 Wrobleski, STMoslin, RLin, SZhang, YSpergel, SKempson, JTokarski, JSStrnad, JZupa-Fernandez, ACheng, LShuster, DGillooly, KYang, XHeimrich, EMcIntyre, KWChaudhry, CKhan, JRuzanov, MTredup, JMulligan, DXie, DSun, HHuang, CD'Arienzo, CAranibar, NChiney, MChimalakonda, APitts, WJLombardo, LCarter, PHBurke, JRWeinstein, DS Highly Selective Inhibition of Tyrosine Kinase 2 (TYK2) for the Treatment of Autoimmune Diseases: Discovery of the Allosteric Inhibitor BMS-986165. J Med Chem 62:8973-8995 (2019)  
Target
Name:
Non-receptor tyrosine-protein kinase TYK2 [5-1181]
Synonyms:
Non-receptor tyrosine-protein kinase TYK2 Tyk2
Type:
PROTEIN
Mol. Mass.:
132654.63
Organism:
Mus musculus
Description:
ChEMBL_105608
Residue:
1177
  
Inhibitor
Name:
BDBM50519542
Synonyms:
CHEMBL4572855
Type:
Small organic molecule
Emp. Form.:
C22H21FN8O2
Mol. Mass.:
448.4529
SMILES:
CNC(=O)c1cnc(Nc2cc(C)c(F)cn2)cc1Nc1cccc(-c2nc[nH]n2)c1OC
: