Target
Cyclin-T1/Cyclin-dependent kinase 9
Ligand
BDBM50519549
Substrate
Meas. Tech.
ChEMBL_1876100 (CHEMBL4377494)
IC50
9.0±n/a nM
Citation
 Wang, XYu, CWang, CMa, YWang, TLi, YHuang, ZZhou, MSun, PZheng, JYang, SFan, YXiang, R Novel cyclin-dependent kinase 9 (CDK9) inhibitor with suppression of cancer stemness activity against non-small-cell lung cancer. Eur J Med Chem 181:0 (2019)  
Target
Name:
Cyclin-T1/Cyclin-dependent kinase 9
Synonyms:
CDK9/ Cyclin-T1 CDK9/Cyclin T Cyclin T1/dependent kinase 9 | Cyclin-Dependent Kinase 9 (CDK9)
Type:
Protein Complex
Mol. Mass.:
Description:
Components:
This complex has 2 components.
Component 1
Name:
Cyclin-T1
Synonyms:
CCNT1 CycT Cyclin T Cyclin-T
Type:
Enzyme Subunit
Mol. Mass.:
80712.40
Organism:
Homo sapiens (Human)
Description:
Residue:
726
  
Component 2
Name:
Cyclin-dependent kinase 9
Synonyms:
C-2K CDK9 Cell division cycle 2-like protein kinase 4 Cyclin-Dependent Kinase 9 (CDK9) Serine/threonine-protein kinase PITALRE Tat-associated kinase complex catalytic subunit
Type:
Enzyme Subunit
Mol. Mass.:
42789.13
Organism:
Homo sapiens (Human)
Description:
Residue:
372
  
Inhibitor
Name:
BDBM50519549
Synonyms:
CHEMBL4573953
Type:
Small organic molecule
Emp. Form.:
C27H35N7O3S2
Mol. Mass.:
569.742
SMILES:
CN(C)C(=O)c1cc2cnc(Nc3ccc(cc3)S(=O)(=O)NCCCCCCN=C=S)nc2n1C1CCCC1
: