Target
Cyclin-dependent kinase 4/G1/S-specific cyclin-D3
Ligand
BDBM50519560
Substrate
Meas. Tech.
ChEMBL_1876096 (CHEMBL4377490)
IC50
148±n/a nM
Citation
 Wang, XYu, CWang, CMa, YWang, TLi, YHuang, ZZhou, MSun, PZheng, JYang, SFan, YXiang, R Novel cyclin-dependent kinase 9 (CDK9) inhibitor with suppression of cancer stemness activity against non-small-cell lung cancer. Eur J Med Chem 181:0 (2019)  
Target
Name:
Cyclin-dependent kinase 4/G1/S-specific cyclin-D3
Synonyms:
CDK4/Cyclin D3
Type:
Mol. Mass.:
Description:
ASSAY_ID of ChEMBL is 1806445
Components:
This complex has 2 components.
Component 1
Name:
Cyclin-dependent kinase 4
Synonyms:
CDK4 Cell division protein kinase 4 PSK-J3
Type:
Enzyme Subunit
Mol. Mass.:
33731.96
Organism:
Homo sapiens (Human)
Description:
P11802
Residue:
303
  
Component 2
Name:
G1/S-specific cyclin-D3
Synonyms:
CCND3 | CCND3_HUMAN
Type:
Enzyme
Mol. Mass.:
32521.90
Organism:
Homo sapiens (Human)
Description:
P30281
Residue:
292
  
Inhibitor
Name:
BDBM50519560
Synonyms:
CHEMBL4548580
Type:
Small organic molecule
Emp. Form.:
C29H37N7O2S
Mol. Mass.:
547.715
SMILES:
CN(C)C(=O)c1cc2cnc(Nc3ccc(NC(=O)CCCCCCCN=C=S)cc3)nc2n1C1CCCC1
: