Target
Dual specificity calcium/calmodulin-dependent 3',5'-cyclic nucleotide phosphodiesterase 1A
Ligand
BDBM50073697
Substrate
Meas. Tech.
ChEBML_156007
IC50
60±n/a nM
Citation
 Ho, GDSilverman, LBercovici, APuchalski, CTulshian, DXia, YCzarniecki, MGreen, MCleven, RZhang, HFawzi, A Synthesis and evaluation of potent and selective c-GMP phosphodiesterase inhibitors. Bioorg Med Chem Lett 9:7-12 (1999)  
Target
Name:
Dual specificity calcium/calmodulin-dependent 3',5'-cyclic nucleotide phosphodiesterase 1A
Synonyms:
Calcium/calmodulin-dependent 3',5'-cyclic nucleotide phosphodiesterase 1A PDE1A Phosphodiesterase 1 | Phosphodiesterase 1A
Type:
Enzyme Catalytic Domain
Mol. Mass.:
60835.05
Organism:
BOVINE
Description:
Phosphodiesterase 1 0 BOVINE::P14100
Residue:
530
  
Inhibitor
Name:
BDBM50073697
Synonyms:
5-methyl-2-(1-propylbutyl)-(6aR,9aS)-3,4,5,8-tetrahydrocyclopenta[4,5]imidazo[2,1-b]purin-4-one | CHEMBL280307
Type:
Small organic molecule
Emp. Form.:
C18H27N5O
Mol. Mass.:
329.4399
SMILES:
CCCC(CCC)c1nc2N3[C@H]4CCC[C@H]4N=C3N(C)C(=O)c2[nH]1
: