Target
Bone morphogenetic protein receptor type-2
Ligand
BDBM50519662
Substrate
Meas. Tech.
ChEMBL_1877753 (CHEMBL4379147)
IC50
>10000±n/a nM
Citation
 Zhao, LLi, YWang, YQiao, ZMiao, ZYang, JHuang, LTian, CLi, LChen, DYang, S Discovery of 4 J Med Chem 62:10691-10710 (2019)  
Target
Name:
Bone morphogenetic protein receptor type-2
Synonyms:
BMPR2 Bone Morphogenetic Protein Receptor type II (BMPR2) PPH1
Type:
PROTEIN
Mol. Mass.:
115194.11
Organism:
Homo sapiens (Human)
Description:
ChEMBL_774306
Residue:
1038
  
Inhibitor
Name:
BDBM50519662
Synonyms:
CHEMBL4438748
Type:
Small organic molecule
Emp. Form.:
C26H23N3O5
Mol. Mass.:
457.4779
SMILES:
CN(C)c1ccc(cc1)C(=O)Nc1cccc(NC(=O)COc2ccc3c(c2)occc3=O)c1
: