Target
Rho-associated protein kinase 1
Ligand
BDBM50519679
Substrate
Meas. Tech.
ChEMBL_1877681 (CHEMBL4379075)
IC50
144±n/a nM
Citation
 Zhao, LLi, YWang, YQiao, ZMiao, ZYang, JHuang, LTian, CLi, LChen, DYang, S Discovery of 4 J Med Chem 62:10691-10710 (2019)  
Target
Name:
Rho-associated protein kinase 1
Synonyms:
ROCK-I ROCK1_HUMAN Rho-associated protein kinase Rho-associated, coiled-coil-containing protein kinase 1 Rho-kinase (ROCK I) p160 ROCK-1 | p160ROCK
Type:
Serine/threonine-protein kinase
Mol. Mass.:
158156.77
Organism:
Homo sapiens (Human)
Description:
Q13464
Residue:
1354
  
Inhibitor
Name:
BDBM50519679
Synonyms:
CHEMBL4558371
Type:
Small organic molecule
Emp. Form.:
C26H25N3O5
Mol. Mass.:
459.4938
SMILES:
CN(C)c1ccc(cc1)C(=O)Nc1cccc(NC(=O)COc2ccc3C(=O)CCOc3c2)c1
: