Target
Rho-associated protein kinase 2
Ligand
BDBM50519706
Substrate
Meas. Tech.
ChEMBL_1877682 (CHEMBL4379076)
IC50
41±n/a nM
Citation
 Zhao, LLi, YWang, YQiao, ZMiao, ZYang, JHuang, LTian, CLi, LChen, DYang, S Discovery of 4 J Med Chem 62:10691-10710 (2019)  
Target
Name:
Rho-associated protein kinase 2
Synonyms:
KIAA0619 ROCK2 Rho kinase 2 (ROCKII) Rho-associated protein kinase 2 (ROCK2) Rho-associated protein kinase 2/Transforming protein RhoA Rho-associated, coiled-coil-containing protein kinase II p164 ROCK-2
Type:
Protein
Mol. Mass.:
160885.43
Organism:
Homo sapiens (Human)
Description:
O75116
Residue:
1388
  
Inhibitor
Name:
BDBM50519706
Synonyms:
CHEMBL4437283
Type:
Small organic molecule
Emp. Form.:
C24H17N3O7
Mol. Mass.:
459.4077
SMILES:
[O-][N+](=O)c1cccc(c1)C(=O)Nc1cccc(NC(=O)COc2ccc3c(c2)occc3=O)c1
: