Target
Carbonic anhydrase 7
Ligand
BDBM29278
Substrate
Meas. Tech.
ChEMBL_1878476 (CHEMBL4379870)
Ki
10.0±n/a nM
Citation
 Bua, SLomelino, CMurray, ABOsman, SMALOthman, ZABozdag, MAbdel-Aziz, HAEldehna, WMMcKenna, RNocentini, ASupuran, CT "A Sweet Combination": Developing Saccharin and Acesulfame K Structures for Selectively Targeting the Tumor-Associated Carbonic Anhydrases IX and XII. J Med Chem 63:321-333 (2020)  
Target
Name:
Carbonic anhydrase 7
Synonyms:
CA-VII CAH7_HUMAN Carbonic anhydrase Carbonic anhydrase VII (CA VII)
Type:
Enzyme
Mol. Mass.:
29664.11
Organism:
Homo sapiens (Human)
Description:
Human cloned isozyme.
Residue:
264
  
Inhibitor
Name:
BDBM29278
Synonyms:
CHEMBL310671 SAC Saccharin
Type:
Small organic molecule
Emp. Form.:
C7H5NO3S
Mol. Mass.:
183.185
SMILES:
O=C1NS(=O)(=O)c2ccccc12
: