Target
Beta-secretase 1
Ligand
BDBM50519870
Substrate
Meas. Tech.
ChEMBL_1878631 (CHEMBL4380025)
IC50
33000±n/a nM
Citation
 Wichur, TWi?ckowska, AWi?ckowski, KGody?, JJo?czyk, JValdivieso, ÁDRPanek, DPasieka, ASabaté, RKnez, DGobec, SMalawska, B 1-Benzylpyrrolidine-3-amine-based BuChE inhibitors with anti-aggregating, antioxidant and metal-chelating properties as multifunctional agents against Alzheimer's disease. Eur J Med Chem 187:0 (2020)  
Target
Name:
Beta-secretase 1
Synonyms:
ASP2 Aspartyl protease 2 BACE1 Beta-secretase (BACE) Beta-secretase 1 (BACE 1) Beta-secretase 1 (BACE1) Beta-site amyloid precursor protein cleaving enzyme 1 Memapsin-2 beta-Secretase (BACE-1) | beta-Secretase (BACE1)
Type:
Protein
Mol. Mass.:
55755.10
Organism:
Homo sapiens (Human)
Description:
P56817
Residue:
501
  
Inhibitor
Name:
BDBM50519870
Synonyms:
CHEMBL4582631
Type:
Small organic molecule
Emp. Form.:
C31H38N4O2
Mol. Mass.:
498.659
SMILES:
Cc1c(OCc2ccccc2)cccc1N1CCN(CC(=O)NC2CCN(Cc3ccccc3)C2)CC1
: