Target
Cholinesterase
Ligand
BDBM50519873
Substrate
Meas. Tech.
ChEMBL_1878607 (CHEMBL4380001)
IC50
3260±n/a nM
Citation
 Wichur, TWi?ckowska, AWi?ckowski, KGody?, JJo?czyk, JValdivieso, ÁDRPanek, DPasieka, ASabaté, RKnez, DGobec, SMalawska, B 1-Benzylpyrrolidine-3-amine-based BuChE inhibitors with anti-aggregating, antioxidant and metal-chelating properties as multifunctional agents against Alzheimer's disease. Eur J Med Chem 187:0 (2020)  
Target
Name:
Cholinesterase
Synonyms:
BCHE CHLE_HORSE | Cholinesterase
Type:
Enzyme
Mol. Mass.:
65643.35
Organism:
Equus caballus (Horse)
Description:
P81908
Residue:
574
  
Inhibitor
Name:
BDBM50519873
Synonyms:
CHEMBL4528953
Type:
Small organic molecule
Emp. Form.:
C26H37N3
Mol. Mass.:
391.5921
SMILES:
C(CN1CCCC(CCc2ccccc2)C1)NC1CCN(Cc2ccccc2)C1
: