Target
Chymase
Ligand
BDBM50520048
Substrate
Meas. Tech.
ChEMBL_1879017 (CHEMBL4380411)
Ki
1.7±n/a nM
Citation
 Li, CYYap, KSwedberg, JECraik, DJde Veer, SJ Binding Loop Substitutions in the Cyclic Peptide SFTI-1 Generate Potent and Selective Chymase Inhibitors. J Med Chem 63:816-826 (2020)  
Target
Name:
Chymase
Synonyms:
Alpha-chymase CMA1_HUMAN CYM Mast cell protease I
Type:
Enzyme
Mol. Mass.:
27340.12
Organism:
Homo sapiens (Human)
Description:
Residue:
247
  
Inhibitor
Name:
BDBM50520048
Synonyms:
CHEMBL4450993
Type:
Small organic molecule
Emp. Form.:
C71H92N14O20S2
Mol. Mass.:
1525.702
SMILES:
CC[C@H](C)[C@@H]1NC(=O)[C@@H]2CCCN2C(=O)[C@@H]2CCCN2C(=O)[C@H](CCC(O)=O)NC(=O)[C@H](CO)NC(=O)[C@H](Cc2ccc(O)cc2)NC(=O)[C@H](C)NC(=O)[C@@H]2CSSC[C@H](NC1=O)C(=O)N[C@@H](Cc1ccccc1)C(=O)N1CCC[C@H]1C(=O)N[C@@H](CC(O)=O)C(=O)NCC(=O)N[C@@H](Cc1ccccc1)C(=O)N2
: