Target
Chymase
Ligand
BDBM50520059
Substrate
Meas. Tech.
ChEMBL_1879017 (CHEMBL4380411)
Ki
11±n/a nM
Citation
 Li, CYYap, KSwedberg, JECraik, DJde Veer, SJ Binding Loop Substitutions in the Cyclic Peptide SFTI-1 Generate Potent and Selective Chymase Inhibitors. J Med Chem 63:816-826 (2020)  
Target
Name:
Chymase
Synonyms:
Alpha-chymase CMA1_HUMAN CYM Mast cell protease I
Type:
Enzyme
Mol. Mass.:
27340.12
Organism:
Homo sapiens (Human)
Description:
Residue:
247
  
Inhibitor
Name:
BDBM50520059
Synonyms:
CHEMBL4561218
Type:
Small organic molecule
Emp. Form.:
C71H102N18O19S2
Mol. Mass.:
1575.809
SMILES:
CC[C@H](C)[C@@H]1NC(=O)[C@@H]2CCCN2C(=O)[C@@H]2CCCN2C(=O)[C@@H](NC(=O)[C@H](CO)NC(=O)[C@H](Cc2ccc(O)cc2)NC(=O)[C@H](CCC(N)=O)NC(=O)[C@@H]2CSSC[C@H](NC1=O)C(=O)N[C@@H](Cc1ccccc1)C(=O)N1CCC[C@H]1C(=O)N[C@@H](CC(O)=O)C(=O)NCC(=O)N[C@@H](CCCNC(N)=N)C(=O)N2)[C@@H](C)CC
: