Target
Serine/threonine-protein kinase ULK1
Ligand
BDBM50520142
Substrate
Meas. Tech.
ChEMBL_1879133 (CHEMBL4380527)
IC50
9.0±n/a nM
Citation
 Lefranc, JSchulze, VKHillig, RCBriem, HPrinz, FMengel, AHeinrich, TBalint, JRengachari, SIrlbacher, HStöckigt, DBömer, UBader, BGradl, SNNising, CFvon Nussbaum, FMumberg, DPanne, DWengner, AM Discovery of BAY-985, a Highly Selective TBK1/IKK? Inhibitor. J Med Chem 63:601-612 (2020)  
Target
Name:
Serine/threonine-protein kinase ULK1
Synonyms:
ATG1 KIAA0722 ULK1_HUMAN hATG1
Type:
PROTEIN
Mol. Mass.:
112661.80
Organism:
Homo sapiens (Human)
Description:
ChEMBL_1510275
Residue:
1050
  
Inhibitor
Name:
BDBM50520142
Synonyms:
CHEMBL4435393
Type:
Small organic molecule
Emp. Form.:
C28H31F3N8O
Mol. Mass.:
552.5939
SMILES:
C[C@@H](N1CCN(CC1)C(=O)CC(F)(F)F)c1ccnc(Nc2nc3ccc(cc3[nH]2)-c2cnn(CC3CC3)c2)c1
: