Target
Asialoglycoprotein receptor 1
Ligand
BDBM50074090
Substrate
Meas. Tech.
ChEMBL_36369 (CHEMBL650120)
Ki
93±n/a nM
Citation
 Sliedregt, LARensen, PCRump, ETvan Santbrink, PJBijsterbosch, MKValentijn, ARvan der Marel, GAvan Boom, JHvan Berkel, TJBiessen, EA Design and synthesis of novel amphiphilic dendritic galactosides for selective targeting of liposomes to the hepatic asialoglycoprotein receptor. J Med Chem 42:609-18 (1999)  
Target
Name:
Asialoglycoprotein receptor 1
Synonyms:
ASGP-R 1 ASGR1_MOUSE Asgr1 Hepatic lectin 1 | mHL-1
Type:
PROTEIN
Mol. Mass.:
32590.63
Organism:
Mus musculus
Description:
ChEMBL_36369
Residue:
284
  
Inhibitor
Name:
BDBM50074090
Synonyms:
CHEMBL2368210 | Galactoside analogue
Type:
Small organic molecule
Emp. Form.:
C65H110N8O30
Mol. Mass.:
1483.6045
SMILES:
OC[C@@H]1O[C@@H](OCCCCC(=O)NCCCNC(=O)CCOCC(COCCC(=O)NCCCNC(=O)CCCCO[C@@H]2O[C@@H](CO)[C@H](O)[C@H](O)[C@@H]2O)(COCCC(=O)NCCCNC(=O)CCCCO[C@@H]2O[C@@H](CO)[C@H](O)[C@H](O)[C@@H]2O)NC(=O)CNC(=O)OCc2ccccc2)[C@@H](O)[C@@H](O)[C@H]1O
: