Target
Adenosine receptor A3
Ligand
BDBM50074219
Substrate
Meas. Tech.
ChEMBL_31865 (CHEMBL644094)
Ki
248±n/a nM
Citation
 Li, AHMoro, SForsyth, NMelman, NJi, XDJacobson, KA Synthesis, CoMFA analysis, and receptor docking of 3,5-diacyl-2, 4-dialkylpyridine derivatives as selective A3 adenosine receptor antagonists. J Med Chem 42:706-21 (1999)  
Target
Name:
Adenosine receptor A3
Synonyms:
A3 adenosine receptor (hA3) ADORA3 | Adenosine A3 receptor (A3AR)
Type:
G Protein-Coupled Receptor (GPCR)
Mol. Mass.:
36197.32
Organism:
Homo sapiens (Human)
Description:
P0DMS8
Residue:
318
  
Inhibitor
Name:
BDBM50074219
Synonyms:
8-Ethyl-1-oxo-6-phenyl-3,4-dihydro-1H-thiopyrano[3,4-c]pyridine-5-carboxylic acid propyl ester | CHEMBL348766
Type:
Small organic molecule
Emp. Form.:
C20H21NO3S
Mol. Mass.:
355.451
SMILES:
CCCOC(=O)c1c2CCSC(=O)c2c(CC)nc1-c1ccccc1
: