Target
Corticotropin-releasing factor receptor 1
Ligand
BDBM50074349
Substrate
Meas. Tech.
ChEMBL_51111 (CHEMBL666549)
Ki
2±n/a nM
Citation
 Arvanitis, AGGilligan, PJChorvat, RJCheeseman, RSChristos, TEBakthavatchalam, RBeck, JPCocuzza, AJHobbs, FWWilde, RGArnold, CChidester, DCurry, MHe, LHollis, AKlaczkiewicz, JKrenitsky, PJRescinito, JPScholfield, ECulp, SDe Souza, EBFitzgerald, LGrigoriadis, DTam, SWShen, HL Non-peptide corticotropin-releasing hormone antagonists: syntheses and structure-activity relationships of 2-anilinopyrimidines and -triazines. J Med Chem 42:805-18 (1999)  
Target
Name:
Corticotropin-releasing factor receptor 1
Synonyms:
CRF-R CRF1 CRFR1 CRH-R 1 CRHR1 Corticotropin-releasing factor receptor 1 (CRF-1) Corticotropin-releasing hormone receptor 1
Type:
Enzyme
Mol. Mass.:
50744.31
Organism:
Homo sapiens (Human)
Description:
P34998
Residue:
444
  
Inhibitor
Name:
BDBM50074349
Synonyms:
(2-Bromo-4-isopropyl-phenyl)-ethyl-[4-(1-ethyl-propyl)-6-methyl-pyrimidin-2-yl]-amine | CHEMBL167407
Type:
Small organic molecule
Emp. Form.:
C21H30BrN3
Mol. Mass.:
404.387
SMILES:
CCC(CC)c1cc(C)nc(n1)N(CC)c1ccc(cc1Br)C(C)C
: